[USRP-users] make test error

Jan Krämer kraemer.jn at gmail.com
Thu Oct 29 05:41:09 EDT 2015


Hi,

the test_005 tries to test a tag propagation behaviour for the
multiply_matrix block which has not been implemented in 3.7.8 or 3.7.8.1
(Martin correct me if I am wrong).
It is kind of fixed in the master branch. In any case it is should not be a
problem if the test fails other than your application depends on the not
yet implemented tag propagation.
The block works fine for the standard tag propagation policies.

Cheers,
Jan

2015-10-29 8:28 GMT+01:00 PanBreeze via USRP-users <
usrp-users at lists.ettus.com>:

> Dear,
>
> I am building UHD3.9.1 + gnuradio3.7.8 from source on Ubuntu 15.10.
>
> The building of UHD is ok.
>
> GNURadio building:
> "cmake .." is ok
> "make" is ok
> "make test":
> ++++++++++++
> 99% tests passed, 1 tests failed out of 199
>
> Total Test time (real) = 158.31 sec
>
> The following tests FAILED:
>      16 - qa_multiply_matrix_ff (Failed)
> Errors while running CTest
> Makefile:116: recipe for target 'test' failed
> make: *** [test] Error 8
> ++++++++++++++++++++
>
> The I run "ctest -V -R multiply_matrix_ff":
> ++++++++++++++++++++++++++++++++
> UpdateCTestConfiguration  from
> :/home/breeze/gnuradio-3.7.8/build/DartConfiguration.tcl
> UpdateCTestConfiguration  from
> :/home/breeze/gnuradio-3.7.8/build/DartConfiguration.tcl
> Test project /home/breeze/gnuradio-3.7.8/build
> Constructing a list of tests
> Done constructing a list of tests
> Checking test dependency graph...
> Checking test dependency graph end
> test 16
>     Start 16: qa_multiply_matrix_ff
>
> 16: Test command: /bin/sh
> "/home/breeze/gnuradio-3.7.8/build/gr-blocks/python/blocks/qa_multiply_matrix_ff_test.sh"
> 16: Test timeout computed to be: 9.99988e+06
> 16: ....E
> 16: Using Volk machine: sse4_1_64
> 16: ======================================================================
> 16: ERROR: test_005_t (__main__.test_multiply_matrix_ff)
> 16: Tags
> 16: ----------------------------------------------------------------------
> 16: Traceback (most recent call last):
> 16:   File
> "/home/breeze/gnuradio-3.7.8/gr-blocks/python/blocks/qa_multiply_matrix_ff.py",
> line 148, in test_005_t
> 16:     self.assertTrue(pmt.equal(tag1.key, self.the_tags[1][0].key))
> 16: IndexError: tuple index out of range
> 16:
> 16: ----------------------------------------------------------------------
> 16: Ran 5 tests in 0.014s
> 16:
> 16: FAILED (errors=1)
> 1/1 Test #16: qa_multiply_matrix_ff ............***Failed    0.29 sec
>
> 0% tests passed, 1 tests failed out of 1
>
> Total Test time (real) =   0.31 sec
>
> The following tests FAILED:
>      16 - qa_multiply_matrix_ff (Failed)
> Errors while running CTest
> +++++++++++++++++++++++++++++++++++++++++++
>
> I don't know if multiply_matrix_ff has something wrong or I made some
> mistakes on my building.
>
> Thanks!
>
>
> Breeze Pan <qfpan at outlook.com>
>
> _______________________________________________
> USRP-users mailing list
> USRP-users at lists.ettus.com
> http://lists.ettus.com/mailman/listinfo/usrp-users_lists.ettus.com
>
>
-------------- next part --------------
An HTML attachment was scrubbed...
URL: <http://lists.ettus.com/pipermail/usrp-users_lists.ettus.com/attachments/20151029/c6a7bb1d/attachment-0002.html>


More information about the USRP-users mailing list